{"text_format":"1","workbook":"xlsx","n_sheets":12,"sheets":["Index","Setare fisier","Economii","Tranzactii","Raport Anual","Raport Lunar","VC Previziuni","Colectare date venit","Colectare date cheltuieli","Colectare date 2012","Colectare date 2013","Colectare date 2014"],"not_rendered":{"charts":0,"images":12,"macros":1,"external_links":3,"defined_names":50,"comments":0,"pivot_tables":3},"unopened":[],"bounds":{"document_bytes":16777216,"sheet_cells":100000,"rows_first":2000,"rows_last":500,"rows_between":2000,"halvings":0,"cell_chars":16384,"cell_head_chars":4096},"cells_cut":0,"cells_raw":0,"read":"whole","date_system":"1900"}

{"sheet":"Index","index":0,"n_rows":22,"n_cols":10,"rows_kept":22,"cut":false,"hidden":false,"merged":[[15,3,15,6]]}
[]
[]
[]
[]
[]
[]
[null,null,null,null,null,"Setari"]
[]
{"$rows_left_out":15}
{"sheet":"Setare fisier","index":1,"n_rows":54,"n_cols":11,"rows_kept":54,"cut":false,"hidden":false,"merged":[[4,8,4,9],[3,0,3,4]]}
[]
[]
[]
["Setare informatii fisier"]
[null,null,null,null,null,null,null,null,"Setare subcategorii cheltuieli"]
[null,"Titulari","Sold initial",null,"Categorii venituri",null,"Categorii cheltuieli",null,"Categorii cheltuieli","Subcategorie cheltuieli"]
[null,"Persoana 1",500,null,"Salariu",null,"Achizitii",null,"Achizitii","Alte achizitii","Sorteaza tabel subcatgorii dupa coloana Categorii cheltuieli!"]
[null,"Persoana 2",750,null,"Alte venituri",null,"Asigurari",null,"Achizitii","Electrocasnice"]
{"$rows_left_out":47}
{"sheet":"Economii","index":2,"n_rows":16,"n_cols":10,"rows_kept":16,"cut":false,"hidden":false,"merged":[[3,0,3,1],[14,0,14,1],[8,0,8,1],[9,0,9,1],[15,0,15,1]]}
[]
[]
[]
["ECONOMII"]
[]
["Data:",{"$f":"TODAY()","v":"2015-10-16"}]
[]
["Curs EUR:",4.45,null,"Curs USD:",3.5]
{"$rows_left_out":9}
{"sheet":"Tranzactii","index":3,"n_rows":1168,"n_cols":12,"rows_kept":1168,"cut":false,"hidden":false,"merged":[[3,0,3,3]]}
[]
[]
[]
["Tranzactii venituri si cheltuieli"]
[]
[null,null,null,"Cheltuieli",null,null,null,"Venituri",null,null,"Balanta"]
[null,null,null,"▼",null,null,null,"▼",null,null,"▼"]
[]
{"$rows_left_out":1161}
{"sheet":"Raport Anual","index":4,"n_rows":29,"n_cols":14,"rows_kept":29,"cut":false,"hidden":false,"merged":[[2,1,2,3]]}
[null,"Raport anual 2015",null,null,null,null,null,null,null,null,null,{"$f":"MONTH(MAX(Table4[Data]))","v":2}]
[]
[null,"Sumar balanta",null,null,null,null,null,"Evolutie 2012 - 2015"]
[null,null,"Venituri","Cheltuieli","Economii","Balanta",null,null,2012,2013,2014,2015,null,"Medie anuala"]
[null,"REALIZAT",{"$f":"'Colectare date venit'!O9","v":6500},{"$f":"'Colectare date cheltuieli'!O56","v":5151.83},{"$f":"'Colectare date cheltuieli'!$O$42","v":500},{"$f":"C5-D5","v":1348.17},null,"Venituri",{"$f":"HLOOKUP($L$1,'Colectare date 2012'!$C$2:$N$7,6,0)","v":6305},{"$f":"HLOOKUP($L$1,'Colectare date 2013'!$C$1:$N$6,6,0)","v":6950},{"$f":"HLOOKUP($L$1,'Colectare date 2014'!$C$3:$N$8,6,0)","v":7600},{"$f":"'Colectare date venit'!$O$9","v":6500},{"$f":"IF(K5>N5,1,IF(K5<N5,-1,0))","v":1},{"$f":"AVERAGE(I5:L5)","v":6838.75}]
[null,"PROIECTAT",{"$f":"HLOOKUP($L$1,'VC Previziuni'!$C$5:N$10,6,0)","v":8000},{"$f":"HLOOKUP($L$1,'VC Previziuni'!$C$5:$N$63,58,0)","v":8686},{"$f":"HLOOKUP($L$1,'VC Previziuni'!$C$5:$N$63,59,0)","v":500},{"$f":"C6-D6","v":-686},null,"Cheltuieli",{"$f":"HLOOKUP($L$1,'Colectare date 2012'!$C$2:$N$52,50,0)","v":7481.5},{"$f":"HLOOKUP($L$1,'Colectare date 2013'!$C$1:$N$55,53,0)","v":3511.4},{"$f":"HLOOKUP($L$1,'Colectare date 2014'!$C$3:$N$59,56,0)","v":7351.9},{"$f":"'Colectare date cheltuieli'!$O$56","v":5151.83},{"$f":"IF(K6>N6,1,IF(K6<N6,-1,0))","v":1},{"$f":"AVERAGE(I6:L6)","v":5874.1574999999993}]
[null,null,null,null,null,null,null,"Economii",{"$f":"HLOOKUP($L$1,'Colectare date 2012'!$C$2:$N$52,51,0)","v":0},{"$f":"HLOOKUP($L$1,'Colectare date 2013'!$C$1:$N$55,54,0)","v":7007.8},{"$f":"HLOOKUP($L$1,'Colectare date 2014'!$C$3:$N$59,57,0)","v":0},{"$f":"'Colectare date cheltuieli'!O42","v":500},{"$f":"IF(K7>N7,1,IF(K7<N7,-1,0))","v":-1},{"$f":"AVERAGE(I7:L7)","v":1876.95}]
[]
{"$rows_left_out":22}
{"sheet":"Raport Lunar","index":5,"n_rows":46,"n_cols":14,"rows_kept":46,"cut":false,"hidden":false,"merged":[[2,0,2,2],[2,3,2,4],[7,1,7,2],[7,4,7,8]]}
[null,"Raport lunar"]
[]
["Selecteaza luna de raportare:",null,null,"Februarie",null,1,"Sumar balanta lunara"]
[null,null,null,null,null,null,null,"Venituri","Cheltuieli","Economii","Procent economisire","Balanta"]
[null,null,null,null,null,null,"REALIZAT",{"$f":"IF($D$3=\"\",\"\",HLOOKUP($D$3,'Colectare date venit'!$A$6:$N$9,4,0))","v":2000},{"$f":"IF($D$3=\"\",\"\",HLOOKUP($D$3,'Colectare date cheltuieli'!C7:O60,50,0))","v":1000},{"$f":"VLOOKUP(\"Economisire\",'Colectare date cheltuieli'!B7:P51,15,0)","v":0},{"$f":"J5/H5","v":0},{"$f":"H5-I5","v":1000}]
[null,null,null,null,null,null,"PROIECTAT",{"$f":"IF($D$3=\"\",\"\",HLOOKUP($D$3,Table3[[#All],[Categorie venituri]:[Decembrie]],4,0))","v":4000},{"$f":"IF($D$3=\"\",\"\",HLOOKUP($D$3,Table2[[#All],[Categorie cheltuieli]:[Decembrie]],50,0))","v":3708},{"$f":"HLOOKUP(D3,'VC Previziuni'!A12:N47,36,0)","v":500},{"$f":"J6/H6","v":0.125},{"$f":"H6-I6","v":292}]
[]
[null,"Analiza venituri",null,null,"Analiza cheltuieli"]
{"$rows_left_out":39}
{"sheet":"VC Previziuni","index":6,"n_rows":63,"n_cols":15,"rows_kept":63,"cut":false,"hidden":false,"merged":[[0,2,0,13],[3,0,3,1]]}
[]
[]
[]
["Setare venituri si cheltuieli previzionate"]
[null,null,1,2,3,4,5,6,7,8,9,10,11,12]
["Categorie venituri","Column1","Ianuarie","Februarie","Martie","Aprilie","Mai","Iunie","Iulie","August","Septembrie","Octombrie","Noiembrie","Decembrie","Total"]
[{"$f":"'Setare fisier'!E7","v":"Salariu"},null,4000,4000,null,null,null,null,null,null,null,null,null,null,{"$f":"SUM(Table3[[#This Row],[Ianuarie]:[Decembrie]])","v":8000}]
[{"$f":"'Setare fisier'!E8","v":"Alte venituri"},null,null,null,null,null,null,null,null,null,null,null,null,null,{"$f":"SUM(Table3[[#This Row],[Ianuarie]:[Decembrie]])","v":0}]
{"$rows_left_out":56}
{"sheet":"Colectare date venit","index":7,"n_rows":9,"n_cols":17,"rows_kept":9,"cut":false,"hidden":false,"merged":[[8,0,8,1],[3,0,3,4],[1,2,1,13],[6,0,6,1],[7,0,7,1]]}
[]
[null,null,{"$f":"IF((COUNTA('Setare fisier'!$E$7:$E$25)-(MATCH(\"Total\",$A:$A,0)-7))<0,CONCATENATE(\"Numarul de categorii de venituri setate este mai mic decat numarul din aceasta pagina cu \",-(COUNTA('Setare fisier'!$E$7:$E$25)-(MATCH(\"Total\",$A:$A,0)-7)),\"!\"),IF((COUNTA('Setare fisier'!$E$7:$E$25)-(MATCH(\"Total\",$A:$A,0)-7))>0,CONCATENATE(\"Numarul de categorii de venituri setate este mai mare decat numarul din aceasta pagina cu \",(COUNTA('Setare fisier'!$E$7:$E$25)-(MATCH(\"Total\",$A:$A,0)-7)),\"!\"),\"\"))","v":""}]
[]
[]
[null,null,1,2,3,4,5,6,7,8,9,10,11,12]
["Categorie venituri","n","Ianuarie","Februarie","Martie","Aprilie","Mai","Iunie","Iulie","August","Septembrie","Octombrie","Noiembrie","Decembrie","Total","Luna raportare"]
[{"$f":"'Setare fisier'!E7","v":"Salariu"},null,{"$f":"SUMIFS(Tranzactii!$J$10:$J$4852,Tranzactii!$A$10:$A$4852,'Colectare date venit'!C$5,Tranzactii!$H$10:$H$4852,'Colectare date venit'!$A7)","v":4500},{"$f":"SUMIFS(Tranzactii!$J$10:$J$4852,Tranzactii!$A$10:$A$4852,'Colectare date venit'!D$5,Tranzactii!$H$10:$H$4852,'Colectare date venit'!$A7)","v":2000},{"$f":"SUMIFS(Tranzactii!$J$10:$J$4852,Tranzactii!$A$10:$A$4852,'Colectare date venit'!E$5,Tranzactii!$H$10:$H$4852,'Colectare date venit'!$A7)","v":0},{"$f":"SUMIFS(Tranzactii!$J$10:$J$4852,Tranzactii!$A$10:$A$4852,'Colectare date venit'!F$5,Tranzactii!$H$10:$H$4852,'Colectare date venit'!$A7)","v":0},{"$f":"SUMIFS(Tranzactii!$J$10:$J$4852,Tranzactii!$A$10:$A$4852,'Colectare date venit'!G$5,Tranzactii!$H$10:$H$4852,'Colectare date venit'!$A7)","v":0},{"$f":"SUMIFS(Tranzactii!$J$10:$J$4852,Tranzactii!$A$10:$A$4852,'Colectare date venit'!H$5,Tranzactii!$H$10:$H$4852,'Colectare date venit'!$A7)","v":0},{"$f":"SUMIFS(Tranzactii!$J$10:$J$4852,Tranzactii!$A$10:$A$4852,'Colectare date venit'!I$5,Tranzactii!$H$10:$H$4852,'Colectare date venit'!$A7)","v":0},{"$f":"SUMIFS(Tranzactii!$J$10:$J$4852,Tranzactii!$A$10:$A$4852,'Colectare date venit'!J$5,Tranzactii!$H$10:$H$4852,'Colectare date venit'!$A7)","v":0},{"$f":"SUMIFS(Tranzactii!$J$10:$J$4852,Tranzactii!$A$10:$A$4852,'Colectare date venit'!K$5,Tranzactii!$H$10:$H$4852,'Colectare date venit'!$A7)","v":0},{"$f":"SUMIFS(Tranzactii!$J$10:$J$4852,Tranzactii!$A$10:$A$4852,'Colectare date venit'!L$5,Tranzactii!$H$10:$H$4852,'Colectare date venit'!$A7)","v":0},{"$f":"SUMIFS(Tranzactii!$J$10:$J$4852,Tranzactii!$A$10:$A$4852,'Colectare date venit'!M$5,Tranzactii!$H$10:$H$4852,'Colectare date venit'!$A7)","v":0},{"$f":"SUMIFS(Tranzactii!$J$10:$J$4852,Tranzactii!$A$10:$A$4852,'Colectare date venit'!N$5,Tranzactii!$H$10:$H$4852,'Colectare date venit'!$A7)","v":0},{"$f":"SUM(C7:N7)","v":6500},{"$f":"IF('Raport Lunar'!$D$3=\"\",\"\",HLOOKUP('Raport Lunar'!$D$3,$A$6:$N$8,Q7+1,0))","v":2000},1]
[{"$f":"'Setare fisier'!E8","v":"Alte venituri"},null,{"$f":"SUMIFS(Tranzactii!$J$10:$J$4852,Tranzactii!$A$10:$A$4852,'Colectare date venit'!C$5,Tranzactii!$H$10:$H$4852,'Colectare date venit'!$A8)","v":0},{"$f":"SUMIFS(Tranzactii!$J$10:$J$4852,Tranzactii!$A$10:$A$4852,'Colectare date venit'!D$5,Tranzactii!$H$10:$H$4852,'Colectare date venit'!$A8)","v":0},{"$f":"SUMIFS(Tranzactii!$J$10:$J$4852,Tranzactii!$A$10:$A$4852,'Colectare date venit'!E$5,Tranzactii!$H$10:$H$4852,'Colectare date venit'!$A8)","v":0},{"$f":"SUMIFS(Tranzactii!$J$10:$J$4852,Tranzactii!$A$10:$A$4852,'Colectare date venit'!F$5,Tranzactii!$H$10:$H$4852,'Colectare date venit'!$A8)","v":0},{"$f":"SUMIFS(Tranzactii!$J$10:$J$4852,Tranzactii!$A$10:$A$4852,'Colectare date venit'!G$5,Tranzactii!$H$10:$H$4852,'Colectare date venit'!$A8)","v":0},{"$f":"SUMIFS(Tranzactii!$J$10:$J$4852,Tranzactii!$A$10:$A$4852,'Colectare date venit'!H$5,Tranzactii!$H$10:$H$4852,'Colectare date venit'!$A8)","v":0},{"$f":"SUMIFS(Tranzactii!$J$10:$J$4852,Tranzactii!$A$10:$A$4852,'Colectare date venit'!I$5,Tranzactii!$H$10:$H$4852,'Colectare date venit'!$A8)","v":0},{"$f":"SUMIFS(Tranzactii!$J$10:$J$4852,Tranzactii!$A$10:$A$4852,'Colectare date venit'!J$5,Tranzactii!$H$10:$H$4852,'Colectare date venit'!$A8)","v":0},{"$f":"SUMIFS(Tranzactii!$J$10:$J$4852,Tranzactii!$A$10:$A$4852,'Colectare date venit'!K$5,Tranzactii!$H$10:$H$4852,'Colectare date venit'!$A8)","v":0},{"$f":"SUMIFS(Tranzactii!$J$10:$J$4852,Tranzactii!$A$10:$A$4852,'Colectare date venit'!L$5,Tranzactii!$H$10:$H$4852,'Colectare date venit'!$A8)","v":0},{"$f":"SUMIFS(Tranzactii!$J$10:$J$4852,Tranzactii!$A$10:$A$4852,'Colectare date venit'!M$5,Tranzactii!$H$10:$H$4852,'Colectare date venit'!$A8)","v":0},{"$f":"SUMIFS(Tranzactii!$J$10:$J$4852,Tranzactii!$A$10:$A$4852,'Colectare date venit'!N$5,Tranzactii!$H$10:$H$4852,'Colectare date venit'!$A8)","v":0},{"$f":"SUM(C8:N8)","v":0},{"$f":"IF('Raport Lunar'!$D$3=\"\",\"\",HLOOKUP('Raport Lunar'!$D$3,$A$6:$N$8,Q8+1,0))","v":0},2]
{"$rows_left_out":2}
{"sheet":"Colectare date cheltuieli","index":8,"n_rows":56,"n_cols":29,"rows_kept":56,"cut":false,"hidden":false,"merged":[[3,0,3,4],[1,2,1,13]]}
[]
[null,null,{"$f":"IF((COUNTA('Setare fisier'!$I$7:$I$60)-(MATCH(\"Total\",$A:$A,0)-8))<0,CONCATENATE(\"Numarul de categorii de cheltuieli setate este mai mic decat numarul din aceasta pagina cu \",-(COUNTA('Setare fisier'!$I$7:$I$60)-(MATCH(\"Total\",$A:$A,0)-8)),,\"!\"),IF((COUNTA('Setare fisier'!$I$7:$I$60)-(MATCH(\"Total\",$A:$A,0)-8))>0,CONCATENATE(\"Numarul de categorii de cheltuieli setate este mai mare decat numarul din aceasta pagina cu \",(COUNTA('Setare fisier'!$I$7:$I$60)-(MATCH(\"Total\",$A:$A,0)-8)),,\"!\"),\"\"))","v":""}]
[]
[]
[]
["CHELTUIELI REALIZATE",null,1,2,3,4,5,6,7,8,9,10,11,12]
["Categorie","Descriere","Ianuarie","Februarie","Martie","Aprilie","Mai","Iunie","Iulie","August","Septembrie","Octombrie","Noiembrie","Decembrie","Total","Luna raportare",null,"Luna preconizat","Diferenta",null,"SUMAR CHELTUIELI"]
[{"$f":"'Setare fisier'!I7","v":"Achizitii"},{"$f":"'Setare fisier'!J7","v":"Alte achizitii"},{"$f":"SUMIFS(Tranzactii!$G$10:$G$4852,Tranzactii!$A$10:$A$4852,C$6,Tranzactii!$D$10:$D$4852,'Colectare date cheltuieli'!$A8,Tranzactii!$E$10:$E$4852,'Colectare date cheltuieli'!$B8)","v":0},{"$f":"SUMIFS(Tranzactii!$G$10:$G$4852,Tranzactii!$A$10:$A$4852,D$6,Tranzactii!$D$10:$D$4852,'Colectare date cheltuieli'!$A8,Tranzactii!$E$10:$E$4852,'Colectare date cheltuieli'!$B8)","v":0},{"$f":"SUMIFS(Tranzactii!$G$10:$G$4852,Tranzactii!$A$10:$A$4852,E$6,Tranzactii!$D$10:$D$4852,'Colectare date cheltuieli'!$A8,Tranzactii!$E$10:$E$4852,'Colectare date cheltuieli'!$B8)","v":0},{"$f":"SUMIFS(Tranzactii!$G$10:$G$4852,Tranzactii!$A$10:$A$4852,F$6,Tranzactii!$D$10:$D$4852,'Colectare date cheltuieli'!$A8,Tranzactii!$E$10:$E$4852,'Colectare date cheltuieli'!$B8)","v":0},{"$f":"SUMIFS(Tranzactii!$G$10:$G$4852,Tranzactii!$A$10:$A$4852,G$6,Tranzactii!$D$10:$D$4852,'Colectare date cheltuieli'!$A8,Tranzactii!$E$10:$E$4852,'Colectare date cheltuieli'!$B8)","v":0},{"$f":"SUMIFS(Tranzactii!$G$10:$G$4852,Tranzactii!$A$10:$A$4852,H$6,Tranzactii!$D$10:$D$4852,'Colectare date cheltuieli'!$A8,Tranzactii!$E$10:$E$4852,'Colectare date cheltuieli'!$B8)","v":0},{"$f":"SUMIFS(Tranzactii!$G$10:$G$4852,Tranzactii!$A$10:$A$4852,I$6,Tranzactii!$D$10:$D$4852,'Colectare date cheltuieli'!$A8,Tranzactii!$E$10:$E$4852,'Colectare date cheltuieli'!$B8)","v":0},{"$f":"SUMIFS(Tranzactii!$G$10:$G$4852,Tranzactii!$A$10:$A$4852,J$6,Tranzactii!$D$10:$D$4852,'Colectare date cheltuieli'!$A8,Tranzactii!$E$10:$E$4852,'Colectare date cheltuieli'!$B8)","v":0},{"$f":"SUMIFS(Tranzactii!$G$10:$G$4852,Tranzactii!$A$10:$A$4852,K$6,Tranzactii!$D$10:$D$4852,'Colectare date cheltuieli'!$A8,Tranzactii!$E$10:$E$4852,'Colectare date cheltuieli'!$B8)","v":0},{"$f":"SUMIFS(Tranzactii!$G$10:$G$4852,Tranzactii!$A$10:$A$4852,L$6,Tranzactii!$D$10:$D$4852,'Colectare date cheltuieli'!$A8,Tranzactii!$E$10:$E$4852,'Colectare date cheltuieli'!$B8)","v":0},{"$f":"SUMIFS(Tranzactii!$G$10:$G$4852,Tranzactii!$A$10:$A$4852,M$6,Tranzactii!$D$10:$D$4852,'Colectare date cheltuieli'!$A8,Tranzactii!$E$10:$E$4852,'Colectare date cheltuieli'!$B8)","v":0},{"$f":"SUMIFS(Tranzactii!$G$10:$G$4852,Tranzactii!$A$10:$A$4852,N$6,Tranzactii!$D$10:$D$4852,'Colectare date cheltuieli'!$A8,Tranzactii!$E$10:$E$4852,'Colectare date cheltuieli'!$B8)","v":0},{"$f":"SUM(C8:N8)","v":0},{"$f":"IF('Raport Lunar'!$D$3=\"\",\"\",HLOOKUP('Raport Lunar'!$D$3,$A$7:$N$55,Q8,0))","v":0},2,{"$f":"HLOOKUP('Raport Lunar'!$D$3,'VC Previziuni'!$A$12:$N$60,ROWS('Colectare date cheltuieli'!$C$7:C8),0)","v":0},{"$f":"R8-P8","v":0},null,"Categorie","Total an","Rank","Total an preconizat",null,"Categorie","Luna Realizat","Luna preconizat","Rank"]
{"$rows_left_out":49}
{"sheet":"Colectare date 2012","index":9,"n_rows":52,"n_cols":18,"rows_kept":52,"cut":false,"hidden":false,"merged":[[3,0,3,1],[4,0,4,1],[5,0,5,1],[49,0,49,1],[6,0,6,1]]}
[]
[null,null,1,2,3,4,5,6,7,8,9,10,11,12]
["VENITURI REALIZATE","-","Ianuarie","Februarie","Martie","Aprilie","Mai","Iunie","Iulie","August","Septembrie","Octombrie","Noiembrie","Decembrie","Total"]
["Salariu",null,3200,3105,3105,3105,3105,3500,3105,3105,3300,3105,3105,4000,{"$f":"SUM(C4:N4)","v":38840}]
["Alte venituri",null,null,null,null,null,null,null,null,null,null,null,null,null,{"$f":"SUM(C5:N5)","v":0}]
["Total",null,{"$f":"SUM(C4:C5)","v":3200},{"$f":"SUM(D4:D5)","v":3105},3105,3105,3105,3500,3105,3105,3300,3105,3105,4000,{"$f":"SUM(C6:N6)","v":38840}]
["YTD Realizat",null,{"$f":"SUM($C6:C6)","v":3200},{"$f":"SUM($C6:D6)","v":6305},{"$f":"SUM($C6:E6)","v":9410},{"$f":"SUM($C6:F6)","v":12515},{"$f":"SUM($C6:G6)","v":15620},{"$f":"SUM($C6:H6)","v":19120},{"$f":"SUM($C6:I6)","v":22225},{"$f":"SUM($C6:J6)","v":25330},{"$f":"SUM($C6:K6)","v":28630},{"$f":"SUM($C6:L6)","v":31735},{"$f":"SUM($C6:M6)","v":34840},{"$f":"SUM($C6:N6)","v":38840}]
[]
{"$rows_left_out":45}
{"sheet":"Colectare date 2013","index":10,"n_rows":55,"n_cols":18,"rows_kept":55,"cut":false,"hidden":false,"merged":[[2,0,2,1],[3,0,3,1],[4,0,4,1]]}
[null,null,1,2,3,4,5,6,7,8,9,10,11,12]
["Categorie venituri","Realizat","Ianuarie","Februarie","Martie","Aprilie","Mai","Iunie","Iulie","August","Septembrie","Octombrie","Noiembrie","Decembrie","Total"]
["Salariu",null,3500,3450,3450,null,null,null,null,null,null,null,null,null,{"$f":"SUM(C3:N3)","v":10400}]
["Alte venituri",null,null,null,null,null,null,null,null,null,null,null,null,null,{"$f":"SUM(C4:N4)","v":0}]
["Total",null,{"$f":"SUM(C3:C4)","v":3500},{"$f":"SUM(D3:D4)","v":3450},3450,0,0,0,0,0,0,0,0,0,{"$f":"SUM(O3:O4)","v":10400}]
["YTD Realizat Venituri",null,{"$f":"SUM($C5:C5)","v":3500},{"$f":"SUM($C5:D5)","v":6950},{"$f":"SUM($C5:E5)","v":10400},{"$f":"SUM($C5:F5)","v":10400},{"$f":"SUM($C5:G5)","v":10400},{"$f":"SUM($C5:H5)","v":10400},{"$f":"SUM($C5:I5)","v":10400},{"$f":"SUM($C5:J5)","v":10400},{"$f":"SUM($C5:K5)","v":10400},{"$f":"SUM($C5:L5)","v":10400},{"$f":"SUM($C5:M5)","v":10400},{"$f":"SUM($C5:N5)","v":10400}]
[]
["CHELTUIELI REALIZATE",null,1,2,3,4,5,6,7,8,9,10,11,12]
{"$rows_left_out":48}
{"sheet":"Colectare date 2014","index":11,"n_rows":59,"n_cols":18,"rows_kept":59,"cut":false,"hidden":false,"merged":[[1,2,1,13],[4,0,4,1],[5,0,5,1],[6,0,6,1]]}
[]
[null,null,""]
[null,null,1,2,3,4,5,6,7,8,9,10,11,12]
["Categorie venituri","n","Ianuarie","Februarie","Martie","Aprilie","Mai","Iunie","Iulie","August","Septembrie","Octombrie","Noiembrie","Decembrie","Total"]
["Salariu",null,3800,3800,null,null,null,null,null,null,null,null,null,null,{"$f":"SUM(C5:N5)","v":7600}]
["Alte venituri",null,null,null,null,null,null,null,null,null,null,null,null,null,{"$f":"SUM(C6:N6)","v":0}]
["Total",null,{"$f":"SUM(C5:C6)","v":3800},{"$f":"SUM(D5:D6)","v":3800},0,0,0,0,0,0,0,0,0,0,{"$f":"SUM(C7:N7)","v":7600}]
["YTD Realizat Venituri",null,{"$f":"SUM($C7:C7)","v":3800},{"$f":"SUM($C7:D7)","v":7600},{"$f":"SUM($C7:E7)","v":7600},{"$f":"SUM($C7:F7)","v":7600},{"$f":"SUM($C7:G7)","v":7600},{"$f":"SUM($C7:H7)","v":7600},{"$f":"SUM($C7:I7)","v":7600},{"$f":"SUM($C7:J7)","v":7600},{"$f":"SUM($C7:K7)","v":7600},{"$f":"SUM($C7:L7)","v":7600},{"$f":"SUM($C7:M7)","v":7600},{"$f":"SUM($C7:N7)","v":7600}]
{"$rows_left_out":51}